{"text_format":"1","workbook":"xlsx","n_sheets":7,"sheets":["Read me","OrderForm","EntryForm","Technical Specificaitons","Links","Dimensions","ReferenceData"],"not_rendered":{"charts":0,"images":173,"macros":1,"external_links":0,"defined_names":9,"comments":2,"pivot_tables":1},"unopened":[],"bounds":{"document_bytes":16777216,"sheet_cells":100000,"rows_first":2000,"rows_last":500,"rows_between":2000,"halvings":0,"cell_chars":16384,"cell_head_chars":4096},"cells_cut":0,"cells_raw":0,"read":"whole","date_system":"1900"}

{"sheet":"Read me","index":0,"n_rows":56,"n_cols":2,"rows_kept":56,"cut":false,"hidden":false,"merged":[]}
[]
[null,"How to fill in the Order Form"]
[null,"Please fill in all the white fields in the Order Form--buyer's info, shipping address and arrangements, dates, instructions."]
[]
[null,"Before order confirmation, Trickit will contact you to discuss the shipment date if the one you requested can't be met."]
[]
[null,"You should use the Entry Form to select the items you would like to order. "]
[]
[null,"How to use the Entry Form"]
[null,"Please select the color and surface for each product, as well as the number of sets you want to order. If you want to order from the same product different combination of colors/surface, use the \"add [product name] row\" button to add another row for the same product. You can remove the last added by using the \"remove last\" button."]
{"$rows_left_out":47}
{"sheet":"OrderForm","index":1,"n_rows":41,"n_cols":13,"rows_kept":41,"cut":false,"hidden":false,"merged":[[1,1,5,1],[1,3,5,4],[1,2,5,2],[12,5,12,7],[1,13,5,13],[8,5,8,6],[1,7,5,12],[1,5,5,6],[8,9,8,10],[35,6,35,8],[21,5,21,7],[0,3,0,7],[31,3,32,4],[31,5,32,12],[17,5,17,7],[20,5,20,7],[24,8,25,11],[26,8,27,12],[14,5,14,7],[15,5,15,7],[16,5,16,7],[13,5,13,7],[18,5,18,7],[19,5,19,7]]}
[null,null,null,"To select your items, please go to the Entry Form. "]
[null,null,null," ",null,"Trickit OOD\nSofia, Bulgaria\nemail: office@trickitholds.com\nhttps://www.trickitholds.com",null,"Order Form\n"]
[]
[]
[]
[]
[]
[]
[null,null,null,"Date:",null,null,null,null,"Desired shipping by date:"]
[null,null,null,"Order #: "]
{"$rows_left_out":32}
{"sheet":"EntryForm","index":2,"n_rows":148,"n_cols":18,"rows_kept":148,"cut":false,"hidden":false,"merged":[[135,0,136,0],[135,1,136,1],[135,2,136,2],[135,3,136,3],[135,4,136,4],[135,5,136,5],[135,6,136,6],[136,12,136,14],[75,0,76,0],[75,1,76,1],[75,2,76,2],[75,3,76,3],[75,4,76,4],[75,5,76,5],[75,6,76,6],[76,12,76,14],[99,0,100,0],[99,2,100,2],[99,4,100,4],[99,5,100,5],[99,6,100,6],[101,1,102,1],[100,12,100,14],[97,0,98,0],[81,5,82,5],[89,0,90,0],[89,1,90,1],[89,2,90,2],[89,3,90,3],[89,4,90,4],[89,5,90,5],[94,12,94,14],[95,0,96,0],[95,2,96,2],[95,4,96,4],[95,5,96,5],[95,6,96,6],[96,12,96,14],[93,0,94,0],[95,1,96,1],[93,3,94,3],[95,3,96,3],[93,5,94,5],[93,6,94,6],[93,2,94,2],[93,4,94,4],[93,1,94,1],[81,6,82,6],[49,0,50,0],[49,2,50,2],[49,3,50,3],[49,4,50,4],[59,1,60,1],[59,2,60,2],[59,3,60,3],[47,0,48,0],[47,2,48,2],[59,4,60,4],[53,0,54,0],[57,0,58,0],[57,1,58,1],[57,2,58,2],[51,0,52,0],[51,2,52,2],[51,3,52,3],[51,4,52,4],[53,2,54,2],[55,0,56,0],[53,3,54,3],[53,4,54,4],[33,0,34,0],[35,0,36,0],[37,0,38,0],[33,4,34,4],[35,4,36,4],[37,4,38,4],[33,1,34,1],[35,1,36,1],[37,1,38,1],[33,2,34,2],[33,3,34,3],[35,3,36,3],[47,3,48,3],[39,5,40,5],[39,6,40,6],[41,4,42,4],[41,5,42,5],[41,6,42,6],[47,4,48,4],[47,5,48,5],[47,6,48,6],[45,4,46,4],[39,1,40,1],[41,1,42,1],[43,1,44,1],[45,1,46,1],[39,0,40,0],[41,0,42,0],[43,0,44,0],[43,3,44,3],[39,4,40,4],[45,0,46,0],[45,2,46,2],[45,3,46,3],[0,12,0,15],[0,2,0,4],[3,4,4,4],[5,3,6,3],[7,3,8,3],[9,3,10,3],[11,3,12,3],[13,3,14,3],[15,3,16,3],[15,6,16,6],[16,12,16,14],[10,12,10,14],[12,12,12,14],[14,12,14,14],[15,5,16,5],[101,5,102,5],[101,6,102,6],[97,3,98,3],[99,3,100,3],[101,3,102,3],[13,1,14,1],[15,1,16,1],[17,1,18,1],[19,1,20,1],[21,1,22,1],[23,1,24,1],[25,1,26,1],[27,1,28,1],[15,4,16,4],[27,3,28,3],[19,2,20,2],[19,4,20,4],[63,1,64,1],[63,2,64,2],[63,3,64,3],[63,4,64,4],[63,5,64,5],[63,6,64,6],[53,1,54,1],[3,0,4,0],[4,12,4,14],[3,2,4,2],[3,5,4,5],[3,6,4,6],[6,12,6,14],[7,0,8,0],[7,2,8,2],[7,4,8,4],[7,5,8,5],[7,6,8,6],[5,0,6,0],[5,2,6,2],[5,4,6,4],[5,5,6,5],[5,6,6,6],[3,1,4,1],[5,1,6,1],[7,1,8,1],[3,3,4,3],[8,12,8,14],[9,0,10,0],[9,2,10,2],[9,4,10,4],[9,5,10,5],[9,6,10,6],[11,0,12,0],[11,2,12,2],[11,4,12,4],[11,5,12,5],[11,6,12,6],[9,1,10,1],[11,1,12,1],[24,12,24,14],[25,0,26,0],[25,2,26,2],[25,4,26,4],[25,5,26,5],[20,12,20,14],[21,0,22,0],[21,2,22,2],[21,4,22,4],[21,5,22,5],[21,6,22,6],[22,12,22,14],[21,3,22,3],[23,3,24,3],[25,3,26,3],[25,6,26,6],[26,12,26,14],[23,0,24,0],[23,2,24,2],[23,4,24,4],[23,5,24,5],[23,6,24,6],[28,12,28,14],[27,0,28,0],[27,2,28,2],[27,4,28,4],[27,5,28,5],[27,6,28,6],[13,0,14,0],[13,2,14,2],[13,4,14,4],[13,5,14,5],[13,6,14,6],[15,0,16,0],[15,2,16,2],[19,0,20,0],[19,5,20,5],[19,6,20,6],[17,3,18,3],[19,3,20,3],[18,12,18,14],[17,0,18,0],[17,2,18,2],[17,4,18,4],[17,5,18,5],[17,6,18,6],[29,0,30,0],[29,1,30,1],[29,2,30,2],[29,3,30,3],[29,4,30,4],[29,5,30,5],[29,6,30,6],[30,12,30,14],[31,0,32,0],[31,1,32,1],[31,2,32,2],[31,3,32,3],[31,4,32,4],[31,5,32,5],[31,6,32,6],[32,12,32,14],[35,2,36,2],[37,2,38,2],[39,2,40,2],[41,2,42,2],[43,2,44,2],[39,3,40,3],[41,3,42,3],[34,12,34,14],[36,12,36,14],[38,12,38,14],[43,4,44,4],[43,5,44,5],[43,6,44,6],[37,3,38,3],[33,5,34,5],[33,6,34,6],[35,5,36,5],[35,6,36,6],[37,5,38,5],[37,6,38,6],[64,12,64,14],[50,12,50,14],[60,12,60,14],[40,12,40,14],[42,12,42,14],[44,12,44,14],[46,12,46,14],[62,12,62,14],[45,5,46,5],[45,6,46,6],[52,12,52,14],[48,12,48,14],[51,6,52,6],[49,5,50,5],[49,6,50,6],[53,5,54,5],[53,6,54,6],[54,12,54,14],[59,5,60,5],[59,6,60,6],[51,5,52,5],[103,0,104,0],[103,1,104,1],[103,2,104,2],[103,3,104,3],[103,4,104,4],[103,5,104,5],[103,6,104,6],[104,12,104,14],[73,3,74,3],[73,4,74,4],[73,5,74,5],[73,6,74,6],[74,12,74,14],[97,2,98,2],[97,4,98,4],[97,5,98,5],[97,6,98,6],[102,12,102,14],[98,12,98,14],[97,1,98,1],[99,1,100,1],[101,0,102,0],[101,2,102,2],[101,4,102,4],[65,0,66,0],[65,1,66,1],[65,2,66,2],[65,3,66,3],[65,4,66,4],[71,3,72,3],[71,4,72,4],[91,3,92,3],[91,4,92,4],[91,0,92,0],[91,1,92,1],[91,2,92,2],[81,0,82,0],[81,1,82,1],[81,2,82,2],[81,3,82,3],[81,4,82,4],[73,0,74,0],[73,1,74,1],[73,2,74,2],[65,5,66,5],[65,6,66,6],[66,12,66,14],[63,0,64,0],[55,1,56,1],[55,2,56,2],[61,0,62,0],[61,1,62,1],[61,2,62,2],[61,3,62,3],[61,4,62,4],[61,5,62,5],[61,6,62,6],[59,0,60,0],[55,3,56,3],[55,4,56,4],[55,5,56,5],[55,6,56,6],[56,12,56,14],[57,3,58,3],[57,4,58,4],[57,5,58,5],[57,6,58,6],[58,12,58,14],[71,5,72,5],[71,6,72,6],[72,12,72,14],[67,0,68,0],[67,1,68,1],[67,2,68,2],[67,3,68,3],[67,4,68,4],[67,5,68,5],[67,6,68,6],[68,12,68,14],[69,0,70,0],[69,1,70,1],[69,2,70,2],[69,3,70,3],[69,4,70,4],[69,5,70,5],[69,6,70,6],[70,12,70,14],[71,0,72,0],[71,1,72,1],[71,2,72,2],[107,0,108,0],[107,1,108,1],[107,2,108,2],[107,3,108,3],[107,4,108,4],[107,5,108,5],[107,6,108,6],[108,12,108,14],[105,0,106,0],[105,1,106,1],[105,2,106,2],[105,3,106,3],[105,4,106,4],[105,5,106,5],[105,6,106,6],[106,12,106,14],[109,0,110,0],[109,1,110,1],[109,2,110,2],[109,3,110,3],[109,4,110,4],[109,5,110,5],[109,6,110,6],[110,12,110,14],[111,0,112,0],[111,1,112,1],[111,2,112,2],[111,3,112,3],[111,4,112,4],[111,5,112,5],[111,6,112,6],[112,12,112,14],[119,2,120,2],[119,3,120,3],[119,4,120,4],[119,5,120,5],[119,6,120,6],[120,12,120,14],[113,0,114,0],[113,1,114,1],[113,2,114,2],[113,3,114,3],[113,4,114,4],[113,5,114,5],[113,6,114,6],[114,12,114,14],[115,3,116,3],[115,4,116,4],[115,5,116,5],[115,6,116,6],[116,12,116,14],[127,0,128,0],[127,1,128,1],[127,2,128,2],[127,3,128,3],[127,4,128,4],[127,5,128,5],[127,6,128,6],[128,12,128,14],[121,0,122,0],[121,1,122,1],[121,2,122,2],[121,3,122,3],[121,4,122,4],[121,5,122,5],[121,6,122,6],[122,12,122,14],[77,6,78,6],[78,12,78,14],[79,0,80,0],[79,1,80,1],[79,2,80,2],[79,3,80,3],[79,4,80,4],[79,5,80,5],[79,6,80,6],[80,12,80,14],[77,0,78,0],[77,1,78,1],[77,2,78,2],[77,3,78,3],[77,4,78,4],[77,5,78,5],[82,12,82,14],[129,0,130,0],[129,1,130,1],[129,2,130,2],[129,3,130,3],[129,4,130,4],[129,5,130,5],[129,6,130,6],[130,12,130,14],[123,0,124,0],[123,1,124,1],[123,2,124,2],[123,3,124,3],[123,4,124,4],[123,5,124,5],[123,6,124,6],[124,12,124,14],[85,0,86,0],[85,1,86,1],[85,2,86,2],[85,3,86,3],[85,4,86,4],[85,5,86,5],[85,6,86,6],[86,12,86,14],[83,0,84,0],[83,1,84,1],[83,2,84,2],[83,3,84,3],[83,4,84,4],[83,5,84,5],[83,6,84,6],[84,12,84,14],[89,6,90,6],[90,12,90,14],[87,0,88,0],[87,1,88,1],[87,2,88,2],[87,3,88,3],[87,4,88,4],[87,5,88,5],[87,6,88,6],[88,12,88,14],[91,5,92,5],[91,6,92,6],[92,12,92,14],[125,0,126,0],[125,1,126,1],[125,2,126,2],[125,3,126,3],[125,4,126,4],[125,5,126,5],[125,6,126,6],[126,12,126,14],[117,0,118,0],[117,1,118,1],[117,2,118,2],[117,3,118,3],[117,4,118,4],[117,5,118,5],[117,6,118,6],[118,12,118,14],[115,0,116,0],[115,1,116,1],[115,2,116,2],[119,0,120,0],[119,1,120,1],[133,0,134,0],[133,1,134,1],[133,2,134,2],[133,3,134,3],[133,4,134,4],[133,5,134,5],[133,6,134,6],[134,12,134,14],[131,0,132,0],[131,1,132,1],[131,2,132,2],[131,3,132,3],[131,4,132,4],[131,5,132,5],[131,6,132,6],[132,12,132,14]]}
[null,null,"Entry Form",null,null,null,null,null,null,null,null,null,"After selecting items, \nclick on Update Order"]
[]
["Product ID",null,"Product","Friction","Price (excl.VAT)","Dimension\n(cm)","Weight\n/set/\n(kg)","PT_Product","PT_inventory #","PT_macros","PT_Friction","PT_UnitPrice","Smooth part surface ","Grip part surface color","Smooth part surface color","Quantity","Amount","Weight\n (kg)"]
["FGDF001",null,"Pressure S Dual\nSet of 3 fiberglass macros size S","Dual",429,"33/27/12\n36/26/10\n33/25/6",2.2000000000000002,"Pressure S",{"$f":"$A$4","v":"FGDF001"},3,"Dual",{"$f":"$E$4","v":429},"<choose surface>","<choose color>","<choose color>",0,{"$f":"$E$4*P4","v":0},{"$f":"$G$4*P4","v":0}]
[null,null,null,null,null,null,null,null,null,null,null,null,"Subtotal (Pressure S Dual)",null,null,{"$f":"SUMIF($M$4:M5,\"<>*subtotal*\",$P$4:P5)","v":0},{"$f":"SUMIF($M$4:M5,\"<>*subtotal*\",$Q$4:Q5)","v":0},{"$f":"SUMIF($M$4:M5,\"<>*subtotal*\",$R$4:R5)","v":0}]
["FGDF002",null,"Pressure M Dual\nSet of 3 fiberglass macros size М","Dual",534,"48/38/8    \n 50/45/12  \n50/35/15",5,"Pressure M",{"$f":"$A$6","v":"FGDF002"},3,"Dual",{"$f":"$E$6","v":534},"<choose surface>","<choose color>","<choose color>",0,{"$f":"$E$6*P6","v":0},{"$f":"$G$6*P6","v":0}]
[null,null,null,null,null,null,null,null,null,null,null,null,"Subtotal (Pressure M Dual)",null,null,{"$f":"SUMIF($M$6:M7,\"<>*subtotal*\",$P$6:P7)","v":0},{"$f":"SUMIF($M$6:M7,\"<>*subtotal*\",$Q$6:Q7)","v":0},{"$f":"SUMIF($M$6:M7,\"<>*subtotal*\",$R$6:R7)","v":0}]
["FGDF003",null,"Vacuum S Dual\nSet of 3 fiberglass macros size S","Dual",429,"43/27/8\n 36/32/9 \n 45/23/5",2.2000000000000002,"Vacuum S",{"$f":"$A$8","v":"FGDF003"},3,"Dual",{"$f":"$E$8","v":429},"<choose surface>","<choose color>","<choose color>",0,{"$f":"$E$8*P8","v":0},{"$f":"$G$8*P8","v":0}]
[null,null,null,null,null,null,null,null,null,null,null,null,"Subtotal (Vacuum S Dual)",null,null,{"$f":"SUMIF($M$8:M9,\"<>*subtotal*\",$P$8:P9)","v":0},{"$f":"SUMIF($M$8:M9,\"<>*subtotal*\",$Q$8:Q9)","v":0},{"$f":"SUMIF($M$8:M9,\"<>*subtotal*\",$R$8:R9)","v":0}]
["FGDF004",null,"Vacuum M Dual\nSet of 3 fiberglass macros size М","Dual",534,"54/32/9\n   53/40/11 \n  47/43/13",5,"Vacuum M",{"$f":"$A$10","v":"FGDF004"},3,"Dual",{"$f":"$E$10","v":534},"<choose surface>","<choose color>","<choose color>",0,{"$f":"$E$10*P10","v":0},{"$f":"$G$10*P10","v":0}]
{"$rows_left_out":139}
{"sheet":"Technical Specificaitons","index":3,"n_rows":41,"n_cols":3,"rows_kept":41,"cut":false,"hidden":false,"merged":[[2,1,2,2],[9,1,9,2],[38,1,38,2],[22,1,22,2]]}
[]
[]
[null,"Upon receipt of your order:"]
[null,null,"1) Inspect carefully the packaging - if there are any damages to the carton box, contact the delivery company."]
[null,null,"2) Each macro/hold should be inspected immediately after receiving the order. If you find defects that compromise the strength and safety, or if the appearance is not as expected, please take photos."]
[null,null,"3) Contact Trickit as soon as possible and provide the photos together with description of the defects, so that the problem can be resolved. "]
[]
[]
[]
[null,"Installation"]
{"$rows_left_out":32}
{"sheet":"Links","index":4,"n_rows":87,"n_cols":9,"rows_kept":87,"cut":false,"hidden":true,"merged":[]}
[]
[null,null,"Use for entry form"]
["DUAL",null,null,null,null,"Link"]
["Pressure S","https://drive.google.com/uc?export=view&id=1GuV7YmnBwEfKe3ABunftIYvj5RrcUh9e",{"$f":"D4&E4","v":"https://drive.google.com/uc?export=view&id=1GuV7YmnBwEfKe3ABunftIYvj5RrcUh9e"},"https://drive.google.com/uc?export=view&id=",{"$f":"MID(F4,G4+3,H4-G4-3)","v":"1GuV7YmnBwEfKe3ABunftIYvj5RrcUh9e"},"https://drive.google.com/file/d/1GuV7YmnBwEfKe3ABunftIYvj5RrcUh9e/view?usp=sharing",{"$f":"FIND(\"/d/\",F4)","v":30},{"$f":"FIND(\"/\",F4,G4+3)","v":66}]
["Pressure M","https://drive.google.com/uc?export=view&id=1Z2OQ56fkfVjJw0AuCNzC8e0nnJ6ZDLzy",{"$f":"D5&E5","v":"https://drive.google.com/uc?export=view&id=1Z2OQ56fkfVjJw0AuCNzC8e0nnJ6ZDLzy"},"https://drive.google.com/uc?export=view&id=",{"$f":"MID(F5,G5+3,H5-G5-3)","v":"1Z2OQ56fkfVjJw0AuCNzC8e0nnJ6ZDLzy"},"https://drive.google.com/file/d/1Z2OQ56fkfVjJw0AuCNzC8e0nnJ6ZDLzy/view?usp=sharing",30,{"$f":"FIND(\"/\",F5,G5+3)","v":66}]
["Vaccuum S","https://drive.google.com/uc?export=view&id=1nQ4MDqZa75TemdSk0YFiZ1y9os7TOxnb",{"$f":"D6&E6","v":"https://drive.google.com/uc?export=view&id=1nQ4MDqZa75TemdSk0YFiZ1y9os7TOxnb"},"https://drive.google.com/uc?export=view&id=","1nQ4MDqZa75TemdSk0YFiZ1y9os7TOxnb","https://drive.google.com/file/d/1nQ4MDqZa75TemdSk0YFiZ1y9os7TOxnb/view?usp=sharing",30,66]
["Vaccum M","https://drive.google.com/uc?export=view&id=1Cs852QWd7LOlDOSJtcKYTm6YV5T4MFE2","https://drive.google.com/uc?export=view&id=1Cs852QWd7LOlDOSJtcKYTm6YV5T4MFE2","https://drive.google.com/uc?export=view&id=","1Cs852QWd7LOlDOSJtcKYTm6YV5T4MFE2","https://drive.google.com/file/d/1Cs852QWd7LOlDOSJtcKYTm6YV5T4MFE2/view?usp=sharing",30,66]
["Balance S","https://drive.google.com/uc?export=view&id=1Y1Ou2Ba5EMt5Tk5lQubXsV9Oa_zPA3Vf",{"$f":"D8&E8","v":"https://drive.google.com/uc?export=view&id=1Y1Ou2Ba5EMt5Tk5lQubXsV9Oa_zPA3Vf"},"https://drive.google.com/uc?export=view&id=","1Y1Ou2Ba5EMt5Tk5lQubXsV9Oa_zPA3Vf","https://drive.google.com/file/d/1Y1Ou2Ba5EMt5Tk5lQubXsV9Oa_zPA3Vf/view?usp=sharing",30,66]
["Balance M","https://drive.google.com/uc?export=view&id=1904q2jMr4M3VeFWkrm1oGPvER32INInz","https://drive.google.com/uc?export=view&id=1904q2jMr4M3VeFWkrm1oGPvER32INInz","https://drive.google.com/uc?export=view&id=","1904q2jMr4M3VeFWkrm1oGPvER32INInz","https://drive.google.com/file/d/1904q2jMr4M3VeFWkrm1oGPvER32INInz/view?usp=sharing",30,66]
["Orca","https://drive.google.com/uc?export=view&id=1tod3suu3TGeYpg2UWuPF7_sCYWs9Dfn2",{"$f":"D10&E10","v":"https://drive.google.com/uc?export=view&id=1tod3suu3TGeYpg2UWuPF7_sCYWs9Dfn2"},"https://drive.google.com/uc?export=view&id=","1tod3suu3TGeYpg2UWuPF7_sCYWs9Dfn2","https://drive.google.com/file/d/1tod3suu3TGeYpg2UWuPF7_sCYWs9Dfn2/view?usp=sharing",30,66]
{"$rows_left_out":78}
{"sheet":"Dimensions","index":5,"n_rows":24,"n_cols":19,"rows_kept":24,"cut":false,"hidden":true,"merged":[[12,14,16,14],[12,15,16,15],[17,14,22,14],[17,15,22,15],[3,14,4,14],[3,15,4,15],[5,14,7,14],[5,15,7,15],[8,14,11,14],[8,15,11,15]]}
[null,null,null,null,null,null,null,"Cumulus"]
[null,null,"Planet S","kg",null,null,null,null,null,null,null,null,null,null,null,"pcs","Length cm","width cm","kg"]
[null,1,"d=28 h10",0.59499999999999997,null,null,null,null,null,null,null,null,null,null,"Leave XL",1,95,38,2.8]
[null,2,"d=26 h8",0.49,null,null,null,null,null,null,null,null,null,null,"Leave L",2,67,30,1.5]
[null,3,"d=24 h6",0.43,null,null,null,null,null,null,null,null,null,null,null,null,68,30,1.7]
[null,4,"d=23 h8",0.38,null,null,null,null,null,null,null,null,null,null,"Leave M",3,56,24,0.9]
[null,5,"d=22 h5",0.32,null,null,null,null,null,null,null,null,null,null,null,null,57,20,1]
[null,6,"d=20.5 h5",0.28999999999999998,null,null,null,null,null,null,null,null,null,null,null,null,60,24,1]
[null,7,"d=20 h4",0.245,null,null,null,null,null,null,null,null,null,null,"Leave S",4,41,17,0.5]
[null,8,"d=16 h4",0.19,null,null,null,null,null,null,null,null,null,null,null,null,43,17,0.6]
{"$rows_left_out":15}
{"sheet":"ReferenceData","index":6,"n_rows":53,"n_cols":27,"rows_kept":53,"cut":false,"hidden":true,"merged":[]}
[null,null,null,null,null,null,null,null,null,null,null,null,null,null,null,null,null,null,"Transparent Thermoformed",5,"percent higher"]
[]
[null,null,null,{"$f":"AND(D6:D126)","v":{"$error":"#N/A"}},null,null,{"$f":"AND(G6:G120)","v":{"$error":"#N/A"}},null,null,{"$f":"AND(J6:J120)","v":{"$error":"#N/A"}}]
[null,"Dual",null,null,"Full Friction ",null,null,"Full Friction ",null,null,null,"surface",null,"ShippingYesNo",null,null,"Color of the grip part of the surface",null,"Color of the smooth part of the surface",null,null,null,null,null,null,null,"Color of the smooth part of the surface for thermoformed"]
[null,"Product ID","Description",null,"Product ID","Description",null,"Product ID","Description",null,null,"<choose surface>",null,"Yes",null,null,"<choose color>",null,"<choose color>",null,"Trickit name","Color","RAL Code","RAL Name","Hex Code (nearest match)",null,"<choose color>"]
[null,"FGDF001","Pressure S Dual\nSet of 3 fiberglass macros size S",{"$f":"VLOOKUP(ReferenceData!B6,EntryForm!$A$3:$C$177,3,FALSE)=ReferenceData!C6","v":true},null,null,null,null,null,null,null,"GLOSSY",null,"No",null,null,"White RAL 9016",null,"White RAL 9016",null,"Yellow RAL 1023",null,"RAL 1023","Traffic Yellow","#FAD201",null,"Transparent Thermoformed"]
[null,"FGDF002","Pressure M Dual\nSet of 3 fiberglass macros size М",{"$f":"VLOOKUP(ReferenceData!B7,EntryForm!$A$3:$C$177,3,FALSE)=ReferenceData!C7","v":true},null,null,null,null,null,null,null,"MATTE",null,null,null,null,"Black RAL 9005",null,"Black RAL 9005",null,"Orange RAL 2004",null,"RAL 2004","Pure Orange","#F44611",null,"White RAL 9016"]
[null,"FGDF003","Vacuum S Dual\nSet of 3 fiberglass macros size S",{"$f":"VLOOKUP(ReferenceData!B8,EntryForm!$A$3:$C$177,3,FALSE)=ReferenceData!C8","v":true},null,null,null,null,null,null,null,null,null,null,null,null,"Gray RAL 7001",null,"Gray RAL 7001",null,"Red RAL 3020",null,"RAL 3020","Traffic Red","#CC0605",null,"Black RAL 9005"]
[null,"FGDF004","Vacuum M Dual\nSet of 3 fiberglass macros size М",{"$f":"VLOOKUP(ReferenceData!B9,EntryForm!$A$3:$C$177,3,FALSE)=ReferenceData!C9","v":true},null,null,null,null,null,null,null,null,null,null,null,null,"Dark gray RAL 7011",null,"Dark gray RAL 7011",null,"Violet RAL 4008",null,"RAL 4008","Signal Violet","#924E7D",null,"Gray RAL 7001"]
[null,"FGDF005","Balance S Dual\nSet of 3 fiberglass macros size S",{"$f":"VLOOKUP(ReferenceData!B10,EntryForm!$A$3:$C$177,3,FALSE)=ReferenceData!C10","v":true},null,null,null,null,null,null,null,"surface-Narwhal",null,null,null,null,"Violet RAL 4008",null,"Violet RAL 4008",null,"Dark blue RAL 5005",null,"RAL 5005","Signal Blue","#1E2460",null,"Dark gray RAL 7011"]
{"$rows_left_out":43}