{"text_format":"1","workbook":"xlsx","n_sheets":20,"sheets":["Provider Information","Provider Total Budget by Serv","Provider Service Area","Analysis Tool","Home Delivered Meal Budget","Unit Rate Calculation HDM","Certification HDM","In-Kind Certification HDM","Congregate Meal Budget","Unit Rate Calculation CM","Certification CM","In-Kind Certification CM","Participant Assessment Budget","Unit Rate Calculation PA","Certification PA","In-Kind Certification PA","Transportation Budget","Unit Rate Calculation Transp","Certification Transp","In-Kind Certification Transp"],"not_rendered":{"charts":0,"images":2,"macros":1,"external_links":0,"defined_names":283,"comments":0,"pivot_tables":0},"unopened":[],"bounds":{"document_bytes":16777216,"sheet_cells":100000,"rows_first":2000,"rows_last":500,"rows_between":2000,"halvings":0,"cell_chars":16384,"cell_head_chars":4096},"cells_cut":0,"cells_raw":0,"read":"whole","date_system":"1900"}

{"sheet":"Provider Information","index":0,"n_rows":544,"n_cols":78,"rows_kept":544,"cut":false,"hidden":false,"merged":[[0,7,0,8],[0,9,0,10],[12,5,12,10],[21,3,21,7],[24,5,24,9],[7,5,7,10],[8,5,8,10],[9,5,9,6],[11,1,11,4],[7,1,7,4],[8,1,8,4],[9,1,9,4],[10,1,10,4],[10,5,10,6],[11,5,11,9],[1,1,1,10],[26,4,26,7],[20,3,20,7],[25,4,25,5],[17,5,17,10],[12,1,12,4],[13,1,13,4],[13,5,13,10],[2,1,2,10],[5,1,5,4],[5,5,5,10],[6,1,6,4],[6,5,6,10],[4,1,4,10],[3,1,3,4],[3,5,3,8]]}
[null,{"$f":"NOW()","v":"2020-07-23T18:20:44.220"},null,null,null,null,null,"Submission #",null,null,null,null,null,null,null,null,null,null,null,null,null,null,null,null,null,null,null,null,null,null,null,null,null,null,null,null,null,null,null,null,null,null,null,null,null,null,null,null,null,null,null,null,null,null,null,null,null,null,null,null,null,null,null,null,null,null,null,null,null,null,null,null,null,null,null,null,null,"101ƒ"]
[null,"Texas Health and Human Services"]
[null,"Uniform Rate Negotiation Workbook/Budget "]
[null,"Federal Contract Period:",null,null,null,"10-01-19 / 09-30-20"]
[null,{"$f":"IF(AND(D20=\"Yes\",F24=\"Yes\"),\"Common Provider\",+AA5)","v":""},null,null,null,null,null,null,null,null,null,null,null,null,null,null,null,null,null,null,null,null,null,null,null,null,{"$f":"IF(AND(D20=\"\",F24=\"\"),\"\",+AB5)","v":""},{"$f":"IF(AND(D20=\"Yes\",F24=\"No\"),\"AAA Provider Only\",+AC5)","v":""},{"$f":"IF(AND(D20=\"No\",F24=\"Yes\"),\"Community Services Provider Only\",\"\")","v":""}]
[1,"Nutrition Providers Legal Business Name:"]
[2,"Street Address:"]
[3,"Mailing Address:"]
{"$rows_left_out":537}
{"sheet":"Provider Total Budget by Serv","index":1,"n_rows":497,"n_cols":15,"rows_kept":497,"cut":false,"hidden":false,"merged":[[0,1,0,6],[37,1,37,9],[54,1,54,9],[93,1,93,9],[115,1,115,9],[1,2,1,6],[5,1,5,9],[2,7,2,8],[1,7,1,8],[2,9,2,10],[297,1,297,4],[299,1,299,3],[298,1,298,3],[162,1,162,9],[204,1,204,9],[276,1,276,9],[279,1,279,7]]}
[null,"Provider Total Budget by Service"]
[null,"Provider Name: ",{"$f":"IF(ISBLANK('Provider Information'!F6),\"\",+'Provider Information'!F6)","v":""},null,null,null,null,"AAA Name:",null,{"$f":"+'Provider Information'!D21","v":0}]
[null,{"$f":"NOW()","v":"2020-07-23T18:20:44.220"},null,null,null,null,null,"Region Number:",null,{"$f":"+'Provider Information'!E26","v":0}]
[null,"Cost Area ","Total Agency Budget","Home Delivered Meal Program","Nutrition Education - AAA Clients","Nutrition Education CCS Clients","Congregate Meal Program","Other Meal Programs\n(non-HHS/AES)","Agency Budget not Applicable to Programs","Participant Assessment","Transportation","If applicable replace with title of other agency program","If applicable replace with title of other agency program","If applicable replace with title of other agency program","Balance not budgeted"]
[]
[null,"Personnel"]
[null,"Salaries (Identified by Job Title)"]
[null,null,null,null,null,null,null,null,null,null,null,null,null,null,{"$f":"+C8-(SUM(D8:N8))","v":0}]
{"$rows_left_out":490}
{"sheet":"Provider Service Area","index":2,"n_rows":19,"n_cols":3,"rows_kept":19,"cut":false,"hidden":false,"merged":[[16,1,16,6],[19,1,19,6],[8,1,9,6],[6,1,6,6],[11,1,12,6],[14,1,14,6],[15,1,15,6],[18,1,18,6],[17,1,17,6]]}
[null,{"$f":"NOW()","v":"2020-07-23T18:20:44.220"}]
[null,"Provider Name: ",{"$f":"IF(ISBLANK('Provider Information'!F6),\"\",+'Provider Information'!F6)","v":""}]
[null,"AAA Name:",{"$f":"+'Provider Information'!D21","v":0}]
[null,"Region Number:",{"$f":"+'Provider Information'!E26","v":0}]
[null,"Type of Provider:",{"$f":"+'Provider Information'!B5","v":""}]
[]
[null,"Provider Service Area"]
[]
{"$rows_left_out":12}
{"sheet":"Analysis Tool","index":3,"n_rows":71,"n_cols":12,"rows_kept":71,"cut":false,"hidden":false,"merged":[[3,2,3,6],[2,2,2,7],[1,2,1,6],[10,4,10,5],[11,4,11,5],[12,4,12,5],[49,5,49,6],[4,1,4,7],[24,4,24,5],[16,4,16,5],[17,4,17,5],[47,5,47,6],[48,5,48,6],[8,2,9,5],[5,1,5,7],[27,1,27,7],[35,2,36,3],[33,1,33,10],[35,9,36,10],[38,5,38,6],[37,5,37,6],[22,4,22,5],[23,4,23,5],[35,5,36,7],[20,4,20,5],[13,4,13,5],[14,4,14,5],[15,4,15,5],[18,4,18,5],[19,4,19,5],[21,4,21,5],[70,1,70,10],[50,5,50,6],[51,5,51,6],[69,1,69,10],[54,5,54,6],[52,5,52,6],[61,5,61,6],[59,5,59,6],[62,5,62,6],[58,5,58,6],[53,5,53,6],[46,5,46,6],[39,5,39,6],[40,5,40,6],[45,5,45,6],[32,1,32,10],[41,5,41,6],[42,5,42,6],[43,5,43,6],[44,5,44,6]]}
[null,{"$f":"NOW()","v":"2020-07-23T18:20:44.220"}]
[null,"Provider Name: ",{"$f":"IF(ISBLANK('Provider Information'!F6),\"\",+'Provider Information'!F6)","v":""}]
[null,"AAA Name:",{"$f":"+'Provider Information'!D21","v":0}]
[null,"Region Number:",{"$f":"+'Provider Information'!E26","v":0}]
[null,"Section 1"]
[null,"This section is used to compare the amounts budgeted/allocated to each program by cost area. \nExample: What percent of the agencies personnel cost is budgeted/allocated to home delivered meals versus congregate meals and other agency programs? The information should be used as a review tool to gain an understanding of the agencies overall budget and operations. "]
[]
[]
{"$rows_left_out":64}
{"sheet":"Home Delivered Meal Budget","index":4,"n_rows":104,"n_cols":15,"rows_kept":104,"cut":false,"hidden":false,"merged":[[0,1,0,14],[91,10,91,12],[90,10,90,12],[89,10,89,12],[88,10,88,12],[87,10,87,12],[8,8,11,8],[8,9,11,9],[5,1,6,1],[5,2,6,2],[79,12,79,14],[28,12,34,14],[36,12,40,14],[42,12,51,14],[53,12,61,14],[63,12,77,14],[97,10,97,12],[95,10,95,12],[94,10,94,12],[93,10,93,12],[92,10,92,12],[96,10,96,12],[22,1,22,6],[8,10,11,10],[4,12,4,14],[7,12,7,14],[11,12,11,14],[12,1,12,6],[16,1,16,6],[4,2,4,6],[5,3,6,6],[7,2,7,6],[4,8,4,10],[5,8,6,10],[8,12,8,13],[9,12,9,13],[10,12,10,13],[8,1,11,1],[13,12,15,14],[1,8,3,14],[5,12,6,14],[8,6,11,6],[8,2,11,2],[8,3,11,3],[8,4,11,4],[8,5,11,5],[1,2,1,6],[2,2,2,6],[3,2,3,6],[103,1,103,4],[96,1,96,4],[97,1,97,4],[89,1,89,4],[94,1,94,4],[95,1,95,4],[92,1,92,4],[102,1,102,4],[93,1,93,4],[17,12,21,14],[90,1,90,4],[98,1,98,4],[99,1,99,4],[101,1,101,4],[91,1,91,4],[88,1,88,4],[27,1,27,6],[23,12,26,14],[87,1,87,4],[86,1,86,4],[35,1,35,6],[41,1,41,6],[52,1,52,6],[62,1,62,6],[78,1,78,6]]}
[null,"Home Delivered Meal Budget Worksheet"]
[null,"Provider Name: ",{"$f":"'Provider Information'!$F$6","v":0},null,null,null,null,null,"Review of Most Recent Completed Year Approved Budget to Actual Year End Expense and Current Proposed Budget"]
[null,"AAA Name:",{"$f":"+'Provider Information'!D21","v":0}]
[null,"Region Number:",{"$f":"+'Provider Information'!E26","v":0}]
[null,null,{"$f":"NOW()","v":"2020-07-23T18:20:44.220"},{"$f":"NOW()","v":"2020-07-23T18:20:44.220"},{"$f":"NOW()","v":"2020-07-23T18:20:44.220"},{"$f":"NOW()","v":"2020-07-23T18:20:44.220"},{"$f":"NOW()","v":"2020-07-23T18:20:44.220"},null," "]
[null,"Most Recent Completed Budget Year",2018,null,null,null,null,null," Proposed Budget",null,null,null,"Explanation of Variances"]
[]
[]
{"$rows_left_out":97}
{"sheet":"Unit Rate Calculation HDM","index":5,"n_rows":112,"n_cols":11,"rows_kept":112,"cut":false,"hidden":false,"merged":[[1,3,1,7],[45,2,45,4],[44,6,44,8],[50,6,50,8],[48,2,48,4],[48,6,48,8],[49,2,49,4],[49,6,49,8],[45,6,45,8],[21,1,21,4],[22,1,22,10],[24,1,24,10],[23,1,23,4],[27,1,27,4],[23,8,23,10],[21,8,21,10],[101,2,101,8],[57,2,57,4],[57,6,57,8],[61,2,61,4],[61,6,61,8],[60,2,60,4],[60,6,60,8],[53,2,53,4],[53,6,53,8],[28,1,28,4],[31,1,31,4],[31,8,31,10],[28,8,28,10],[29,1,29,4],[33,8,33,10],[34,8,34,10],[33,1,33,4],[52,6,52,8],[52,2,52,4],[41,2,41,4],[40,2,40,4],[40,6,40,8],[41,6,41,8],[26,1,26,3],[18,1,18,10],[19,1,19,10],[12,1,12,10],[14,1,14,10],[13,1,13,2],[17,1,17,8],[15,1,15,10],[16,1,16,10],[11,1,11,2],[11,8,11,10],[2,3,2,8],[3,3,3,7],[5,1,5,10],[3,9,3,10],[8,1,8,10],[9,1,9,10],[10,1,10,10],[4,1,4,10],[6,1,6,10],[7,1,7,8]]}
[null,null,{"$f":"NOW()","v":"2020-07-23T18:20:44.220"}]
[null,null,"Provider Name: ",{"$f":"+'Provider Information'!F6","v":0}]
[null,null,"AAA Name:",{"$f":"+'Provider Information'!D21","v":0}]
[null,null,"Region Number:",{"$f":"+'Provider Information'!E26","v":0}]
[null,"Home Delivered Meals"]
[null,"BUDGET WORKSHEET CALCULATION OF THE PER MEAL UNIT RATE"]
[]
[null,"1.  Total Budgeted Expenses for Contract Year ",null,null,null,null,null,null,null,"1.",{"$f":"+'Home Delivered Meal Budget'!I80","v":{"$error":"#DIV/0!"}}]
{"$rows_left_out":105}
{"sheet":"Certification HDM","index":6,"n_rows":48,"n_cols":7,"rows_kept":48,"cut":false,"hidden":false,"merged":[[1,3,1,7],[41,2,41,4],[41,6,41,9],[36,2,36,4],[36,6,36,9],[4,1,4,10],[39,2,40,4],[39,6,40,9],[6,1,6,4],[6,6,6,10],[5,1,5,10],[37,2,37,4],[37,6,37,9],[2,3,2,8],[3,3,3,7]]}
[null,null,{"$f":"NOW()","v":"2020-07-23T18:20:44.220"}]
[null,null,"Provider Name: ",{"$f":"+'Provider Information'!F6","v":0}]
[null,null,"AAA Name:",{"$f":"+'Provider Information'!D21","v":0}]
[null,null,"Region Number:",{"$f":"+'Provider Information'!E26","v":0}]
[null,"Home Delivered Meals"]
[null,"BUDGET WORKSHEET CERTIFICATION"]
[]
[null,"        AS SIGNER OF THIS BUDGET WORKSHEET, I HEREBY CERTIFY THAT:"]
{"$rows_left_out":41}
{"sheet":"In-Kind Certification HDM","index":7,"n_rows":49,"n_cols":7,"rows_kept":49,"cut":false,"hidden":false,"merged":[[44,5,44,6],[44,1,44,3],[50,1,50,7],[48,1,48,3],[48,5,48,6],[45,1,45,3],[45,5,45,6],[47,1,47,3],[7,1,7,2],[34,9,34,13],[35,3,35,6],[22,1,22,4],[23,1,23,4],[24,1,24,4],[25,1,25,4],[27,2,27,5],[32,3,32,6],[18,1,18,4],[19,1,19,4],[0,1,0,2],[1,3,1,6],[2,3,2,6],[7,3,7,4],[21,1,21,4],[14,1,14,4],[15,1,15,4],[16,1,16,4],[17,1,17,4],[9,1,9,6],[12,1,12,4],[13,1,13,4],[20,1,20,4],[3,1,3,6],[4,0,4,7],[5,2,5,4]]}
[null,{"$f":"NOW()","v":"2020-07-23T18:20:44.220"},{"$f":"NOW()","v":"2020-07-23T18:20:44.220"}]
[null,null,"AAA Name:",{"$f":"+'Provider Information'!D21","v":0}]
[null,null,"Region Number:",{"$f":"+'Provider Information'!E26","v":0}]
[null,"Home Delivered Meals"]
["IN-KIND MATCH CERTIFICATION"]
[null,"Provider: ",{"$f":"IF(ISBLANK('Provider Information'!F6),\"\",+'Provider Information'!F6)","v":""}]
[]
[null,"In-kind Contribution(s):",null,{"$f":"+G26","v":0}]
{"$rows_left_out":42}
{"sheet":"Congregate Meal Budget","index":8,"n_rows":106,"n_cols":15,"rows_kept":106,"cut":false,"hidden":false,"merged":[[0,1,0,14],[92,1,92,5],[96,1,96,5],[91,8,91,9],[92,8,92,9],[95,11,95,14],[95,1,95,5],[94,11,94,14],[94,8,94,9],[95,8,95,9],[53,12,61,14],[63,12,77,14],[79,12,79,14],[28,12,34,14],[93,8,93,9],[92,11,92,14],[97,11,97,14],[96,11,96,14],[96,8,96,9],[97,8,97,9],[93,11,93,14],[94,1,94,5],[93,1,93,5],[5,1,6,1],[5,2,6,2],[5,3,6,6],[91,1,91,5],[52,1,52,6],[8,1,11,1],[62,1,62,6],[78,1,78,6],[27,1,27,6],[35,1,35,6],[41,1,41,6],[8,2,11,2],[8,3,11,3],[99,11,99,14],[98,8,98,9],[98,11,98,14],[103,1,103,5],[98,1,98,5],[100,1,100,5],[99,1,99,5],[104,1,104,5],[105,1,105,5],[101,1,101,5],[99,8,99,9],[97,1,97,5],[42,12,51,14],[12,1,12,6],[13,12,15,14],[16,1,16,6],[17,12,21,14],[22,1,22,6],[23,12,26,14],[36,12,40,14],[8,8,11,8],[1,8,3,14],[4,8,4,10],[4,12,4,14],[5,8,6,10],[5,12,6,14],[8,9,11,9],[8,10,11,10],[10,12,10,13],[11,12,11,14],[8,12,8,13],[9,12,9,13],[7,12,7,14],[1,2,1,6],[2,2,2,6],[3,2,3,6],[4,2,4,6],[8,5,11,5],[8,6,11,6],[7,2,7,6],[8,4,11,4]]}
[null,"Congregate Meal Budget Worksheet"]
[null,"Provider Name: ",{"$f":"'Provider Information'!$F$6","v":0},null,null,null,null,null,"Review of Most Recent Completed Year Approved Budget to Actual Year End Expense and Current Proposed Budget"]
[null,"AAA Name:",{"$f":"+'Provider Information'!D21","v":0}]
[]
[null,null,{"$f":"NOW()","v":"2020-07-23T18:20:44.220"},null,null,null,null,null," "]
[null,"Most Recent Completed Budget Year",2018,null,null,null,null,null," Proposed Budget",null,null,null,"Explanation of Variances"]
[]
[]
{"$rows_left_out":99}
{"sheet":"Unit Rate Calculation CM","index":9,"n_rows":103,"n_cols":11,"rows_kept":103,"cut":false,"hidden":false,"merged":[[1,3,1,7],[2,9,2,10],[17,1,17,10],[18,1,18,10],[7,1,7,10],[8,1,8,10],[9,1,9,10],[3,1,3,10],[5,1,5,10],[6,1,6,8],[4,1,4,10],[11,1,11,10],[13,1,13,10],[14,1,14,10],[12,1,12,2],[10,1,10,2],[10,8,10,10],[15,1,15,10],[16,1,16,8],[93,2,93,8],[49,2,49,4],[49,6,49,8],[53,2,53,4],[53,6,53,8],[52,6,52,8],[41,6,41,8],[42,2,42,4],[38,6,38,8],[45,2,45,4],[45,6,45,8],[52,2,52,4],[48,2,48,4],[44,6,44,8],[44,2,44,4],[41,2,41,4],[42,6,42,8],[37,2,37,4],[2,3,2,8],[20,8,20,10],[38,2,38,4],[27,8,27,10],[20,1,20,4],[21,1,21,10],[22,1,22,4],[22,8,22,10],[26,1,26,4],[25,1,25,3],[34,2,34,4],[27,1,27,4],[33,2,33,4],[33,6,33,8],[37,6,37,8],[34,6,34,8]]}
[null,null,{"$f":"NOW()","v":"2020-07-23T18:20:44.220"}]
[null,null,"Provider Name: ",{"$f":"+'Provider Information'!F6","v":0}]
[null,null,"AAA Name:",{"$f":"+'Provider Information'!D21","v":0}]
[null,"Congregate Meals"]
[null,"BUDGET WORKSHEET CALCULATION OF THE PER MEAL UNIT RATE"]
[]
[null,"1.  Total Budgeted Expenses for Contract Year ",null,null,null,null,null,null,null,"1.",{"$f":"+'Congregate Meal Budget'!I80","v":{"$error":"#DIV/0!"}}]
[]
{"$rows_left_out":96}
{"sheet":"Certification CM","index":10,"n_rows":44,"n_cols":7,"rows_kept":44,"cut":false,"hidden":false,"merged":[[1,3,1,7],[37,2,37,4],[37,6,37,9],[36,2,36,4],[32,2,32,4],[32,6,32,9],[3,1,3,10],[36,6,36,9],[5,1,5,4],[5,6,5,10],[4,1,4,10],[33,2,33,4],[33,6,33,9],[2,3,2,8]]}
[null,null,{"$f":"NOW()","v":"2020-07-23T18:20:44.220"}]
[null,null,"Provider Name: ",{"$f":"+'Provider Information'!F6","v":0}]
[null,null,"AAA Name:",{"$f":"+'Provider Information'!D21","v":0}]
[null,"Congregate Meals"]
[null,"BUDGET WORKSHEET CERTIFICATION"]
[]
[null,"        AS SIGNER OF THIS BUDGET WORKSHEET, I HEREBY CERTIFY THAT:"]
[]
{"$rows_left_out":37}
{"sheet":"In-Kind Certification CM","index":11,"n_rows":48,"n_cols":7,"rows_kept":48,"cut":false,"hidden":false,"merged":[[26,2,26,5],[31,3,31,6],[21,1,21,4],[22,1,22,4],[33,9,33,13],[2,1,2,6],[3,1,3,6],[8,1,8,6],[11,1,11,4],[12,1,12,4],[6,3,6,4],[4,2,4,4],[6,1,6,2],[19,1,19,4],[20,1,20,4],[13,1,13,4],[14,1,14,4],[15,1,15,4],[16,1,16,4],[0,2,0,3],[1,3,1,6],[49,1,49,7],[47,1,47,3],[47,5,47,6],[44,1,44,3],[44,5,44,6],[23,1,23,4],[24,1,24,4],[46,1,46,3],[43,5,43,6],[43,1,43,3],[46,5,46,6],[34,3,34,6],[17,1,17,4],[18,1,18,4]]}
[null,null,{"$f":"NOW()","v":"2020-07-23T18:20:44.220"}]
[null,null,"AAA Name:",{"$f":"+'Provider Information'!D21","v":0}]
[null,"Congregate Meals"]
[null,"IN-KIND MATCH CERTIFICATION"]
[null,"Provider: ",{"$f":"IF(ISBLANK('Provider Information'!F6),\"\",+'Provider Information'!F6)","v":""}]
[]
[null,"In-kind Contribution(s):",null,{"$f":"+G25","v":0}]
[]
{"$rows_left_out":41}
{"sheet":"Participant Assessment Budget","index":12,"n_rows":119,"n_cols":21,"rows_kept":119,"cut":false,"hidden":false,"merged":[[0,14,80,14],[0,1,0,13],[27,1,27,6],[1,7,3,7],[13,12,15,13],[17,12,21,13],[23,12,26,13],[1,8,3,13],[5,1,6,1],[5,2,6,2],[5,12,6,13],[4,8,4,10],[5,3,6,6],[36,12,40,13],[11,12,11,13],[8,8,11,8],[42,12,51,13],[28,12,34,13],[95,2,95,3],[53,12,61,13],[63,12,77,13],[88,2,88,3],[89,2,89,3],[89,7,89,8],[88,7,88,8],[81,12,81,13],[82,12,82,13],[79,12,79,13],[94,7,94,8],[90,2,90,3],[91,2,91,3],[92,2,92,3],[93,2,93,3],[94,2,94,3],[94,5,94,6],[90,5,90,6],[92,5,92,6],[91,5,91,6],[95,5,95,6],[93,5,93,6],[96,5,96,6],[100,5,100,6],[97,5,97,6],[98,5,98,6],[99,5,99,6],[96,2,96,3],[97,2,97,3],[98,2,98,3],[99,2,99,3],[100,2,100,3],[5,8,6,10],[8,9,11,9],[98,7,98,8],[99,7,99,8],[100,7,100,8],[96,7,96,8],[7,8,7,10],[97,7,97,8],[95,7,95,8],[90,7,90,8],[91,7,91,8],[92,7,92,8],[93,7,93,8],[8,10,11,10],[78,1,78,6],[52,1,52,6],[16,1,16,6],[22,1,22,6],[41,1,41,6],[4,2,4,3],[1,2,1,6],[2,2,2,6],[3,2,3,6],[89,5,89,6],[7,1,7,6],[8,6,11,6],[8,1,11,1],[8,2,11,2],[8,3,11,3],[8,4,11,4],[8,5,11,5],[35,1,35,6],[62,1,62,6],[12,1,12,6],[88,5,88,6]]}
[null,{"$f":"+'Provider Total Budget by Serv'!J4","v":"Participant Assessment"}]
[null,"Provider Name: ",{"$f":"'Provider Information'!$F$6","v":0},null,null,null,null,null,"Review of Most Recent Completed Year Approved Budget to Actual Year End Expense and Current Proposed Budget"]
[null,"AAA Name:",{"$f":"+'Provider Information'!D21","v":0}]
[]
[null,null,{"$f":"NOW()","v":"2020-07-23T18:20:44.220"}]
[null,"Most Recent Completed Budget Year",2018,null,null,null,null,null," Proposed Budget",null,null,null,"Explanation of Variances"]
[]
[]
{"$rows_left_out":112}
{"sheet":"Unit Rate Calculation PA","index":13,"n_rows":111,"n_cols":12,"rows_kept":111,"cut":false,"hidden":false,"merged":[[1,4,1,8],[51,3,51,5],[51,7,51,10],[23,2,23,5],[21,2,21,7],[22,2,22,5],[48,3,48,5],[17,2,17,11],[13,2,13,11],[10,2,10,3],[12,2,12,11],[48,7,48,10],[47,3,47,5],[47,7,47,10],[30,2,30,5],[29,2,29,5],[101,3,101,9],[52,3,52,5],[52,7,52,10],[54,7,54,10],[55,3,55,5],[55,7,55,10],[59,7,59,10],[58,3,58,5],[58,7,58,10],[59,3,59,5],[54,3,54,5],[0,3,0,4],[2,4,2,9],[19,2,19,11],[28,2,28,7],[16,2,16,11],[3,2,3,11],[5,2,5,11],[6,2,6,9],[4,2,4,11],[7,2,7,11],[8,2,8,11],[9,2,9,3],[11,2,11,3],[15,2,15,9],[14,2,14,11],[10,9,10,11]]}
[null,null,null,{"$f":"NOW()","v":"2020-07-23T18:20:44.220"}]
[null,null,null,"Provider Name: ",{"$f":"+'Provider Information'!F6","v":0}]
[null,null,null,"AAA Name:",{"$f":"+'Provider Information'!D21","v":0}]
[null,null,{"$f":"+'Provider Total Budget by Serv'!J4","v":"Participant Assessment"}]
[null,null,"BUDGET WORKSHEET CALCULATION OF THE UNIT RATE"]
[]
[null,null,"1.Total Budgeted Expenses for Contract Year ",null,null,null,null,null,null,null,"1.",{"$f":"+'Participant Assessment Budget'!I80","v":0}]
[]
{"$rows_left_out":104}
{"sheet":"Certification PA","index":14,"n_rows":46,"n_cols":7,"rows_kept":46,"cut":false,"hidden":false,"merged":[[0,2,0,3],[1,3,1,7],[39,2,39,4],[39,6,39,9],[38,2,38,4],[34,2,34,4],[34,6,34,9],[3,1,3,10],[38,6,38,9],[5,1,5,4],[5,6,5,10],[4,1,4,10],[35,2,35,4],[35,6,35,9],[2,3,2,8]]}
[null,null,{"$f":"NOW()","v":"2020-07-23T18:20:44.220"}]
[null,null,"Provider Name: ",{"$f":"+'Provider Information'!F6","v":0}]
[null,null,"AAA Name:",{"$f":"+'Provider Information'!D21","v":0}]
[null,{"$f":"+'Provider Total Budget by Serv'!J4","v":"Participant Assessment"}]
[null,"BUDGET WORKSHEET CERTIFICATION"]
[]
[null,"        AS SIGNER OF THIS BUDGET WORKSHEET, I HEREBY CERTIFY THAT:"]
[]
{"$rows_left_out":39}
{"sheet":"In-Kind Certification PA","index":15,"n_rows":48,"n_cols":7,"rows_kept":48,"cut":false,"hidden":false,"merged":[[46,5,46,6],[46,1,46,3],[43,5,43,6],[43,1,43,3],[18,1,18,4],[19,1,19,4],[49,1,49,7],[47,1,47,3],[47,5,47,6],[4,2,4,4],[6,1,6,2],[44,1,44,3],[44,5,44,6],[26,2,26,5],[31,3,31,6],[17,1,17,4],[12,1,12,4],[6,3,6,4],[20,1,20,4],[13,1,13,4],[14,1,14,4],[15,1,15,4],[0,2,0,3],[1,3,1,6],[33,9,33,13],[34,3,34,6],[21,1,21,4],[22,1,22,4],[23,1,23,4],[24,1,24,4],[2,1,2,6],[3,1,3,6],[8,1,8,6],[11,1,11,4],[16,1,16,4]]}
[null,null,{"$f":"NOW()","v":"2020-07-23T18:20:44.220"}]
[null,null,"AAA Name:",{"$f":"+'Provider Information'!D21","v":0}]
[null,{"$f":"+'Provider Total Budget by Serv'!J4","v":"Participant Assessment"}]
[null,"IN-KIND MATCH CERTIFICATION"]
[null,"Provider: ",{"$f":"IF(ISBLANK('Provider Information'!F6),\"\",+'Provider Information'!F6)","v":""}]
[]
[null,"In-kind Contribution(s):",null,{"$f":"+G25","v":0}]
[]
{"$rows_left_out":41}
{"sheet":"Transportation Budget","index":16,"n_rows":98,"n_cols":14,"rows_kept":98,"cut":false,"hidden":false,"merged":[[11,12,11,13],[7,8,7,10],[81,12,81,13],[1,7,3,7],[1,8,3,13],[12,8,12,10],[79,12,79,13],[78,12,78,13],[63,12,77,13],[8,9,11,9],[8,10,11,10],[52,12,52,13],[62,12,62,13],[53,12,61,13],[0,14,80,14],[5,12,6,13],[7,12,7,13],[16,12,16,13],[13,12,15,13],[80,12,80,13],[42,12,51,13],[35,12,35,13],[28,12,34,13],[36,12,40,13],[22,12,22,13],[0,1,0,13],[22,1,22,6],[27,1,27,6],[4,8,4,10],[5,8,6,10],[35,1,35,6],[41,1,41,6],[17,12,21,13],[23,12,26,13],[8,4,11,4],[8,5,11,5],[8,6,11,6],[12,1,12,6],[16,1,16,6],[8,1,11,1],[8,2,11,2],[8,3,11,3],[41,12,41,13],[12,12,12,13],[27,12,27,13],[8,8,11,8],[52,1,52,6],[80,8,80,10],[97,1,97,5],[94,1,94,5],[96,1,96,5],[93,1,93,5],[95,1,95,5],[91,1,91,5],[92,1,92,5],[62,1,62,6],[78,1,78,6],[82,12,82,13],[90,1,90,5],[89,1,89,5],[88,1,88,5],[86,1,86,5],[85,1,85,5],[87,1,87,5],[1,2,1,6],[2,2,2,6],[3,2,3,6],[7,1,7,6],[4,1,4,2],[4,3,4,4],[4,5,4,6],[5,1,6,1],[5,2,6,2],[5,3,6,6]]}
[null,{"$f":"+'Provider Total Budget by Serv'!K4","v":"Transportation"}]
[null,"Provider Name: ",{"$f":"'Provider Information'!$F$6","v":0},null,null,null,null,null,"Review of Most Recent Completed Year Approved Budget to Actual Year End Expense and Current Proposed Budget"]
[null,"AAA Name:",{"$f":"+'Provider Information'!D21","v":0}]
[]
[null,null,null,{"$f":"NOW()","v":"2020-07-23T18:20:44.220"}]
[null,"Most Recent Completed Budget Year",2018,null,null,null,null,null," Proposed Budget",null,null,null,"Explanation of Variances"]
[]
[]
{"$rows_left_out":91}
{"sheet":"Unit Rate Calculation Transp","index":17,"n_rows":111,"n_cols":12,"rows_kept":111,"cut":false,"hidden":false,"merged":[[19,2,19,11],[28,2,28,7],[51,3,51,5],[51,7,51,10],[47,7,47,10],[23,2,23,5],[21,2,21,7],[22,2,22,5],[48,3,48,5],[48,7,48,10],[47,3,47,5],[30,2,30,5],[29,2,29,5],[101,3,101,9],[52,3,52,5],[52,7,52,10],[54,7,54,10],[55,3,55,5],[55,7,55,10],[54,3,54,5],[58,3,58,5],[59,3,59,5],[59,7,59,10],[58,7,58,10],[17,2,17,11],[13,2,13,11],[10,2,10,3],[12,2,12,11],[6,2,6,9],[9,2,9,3],[11,2,11,3],[15,2,15,9],[14,2,14,11],[16,2,16,11],[10,9,10,11],[0,3,0,4],[4,2,4,11],[1,4,1,8],[2,4,2,9],[8,2,8,11],[7,2,7,11],[3,2,3,11],[5,2,5,11]]}
[null,null,null,{"$f":"NOW()","v":"2020-07-23T18:20:44.220"}]
[null,null,null,"Provider Name: ",{"$f":"+'Provider Information'!F6","v":0}]
[null,null,null,"AAA Name:",{"$f":"+'Provider Information'!D21","v":0}]
[null,null,{"$f":"+'Provider Total Budget by Serv'!K4","v":"Transportation"}]
[null,null,"BUDGET WORKSHEET CALCULATION OF THE UNIT RATE"]
[]
[null,null,"1.Total Budgeted Expenses for Contract Year ",null,null,null,null,null,null,null,"1.",{"$f":"+'Transportation Budget'!I80","v":0}]
[]
{"$rows_left_out":104}
{"sheet":"Certification Transp","index":18,"n_rows":46,"n_cols":7,"rows_kept":46,"cut":false,"hidden":false,"merged":[[0,2,0,3],[39,2,39,4],[39,6,39,9],[3,1,3,10],[4,1,4,10],[5,1,5,4],[5,6,5,10],[34,2,34,4],[34,6,34,9],[1,3,1,7],[35,2,35,4],[35,6,35,9],[38,2,38,4],[38,6,38,9],[2,3,2,8]]}
[null,null,{"$f":"NOW()","v":"2020-07-23T18:20:44.220"}]
[null,null,"Provider Name: ",{"$f":"+'Provider Information'!F6","v":0}]
[null,null,"AAA Name:",{"$f":"+'Provider Information'!D21","v":0}]
[null,{"$f":"+'Provider Total Budget by Serv'!K4","v":"Transportation"}]
[null,"BUDGET WORKSHEET CERTIFICATION"]
[]
[null,"        AS SIGNER OF THIS BUDGET WORKSHEET, I HEREBY CERTIFY THAT:"]
[]
{"$rows_left_out":39}
{"sheet":"In-Kind Certification Transp","index":19,"n_rows":48,"n_cols":7,"rows_kept":48,"cut":false,"hidden":false,"merged":[[46,1,46,3],[43,5,43,6],[43,1,43,3],[6,3,6,4],[20,1,20,4],[13,1,13,4],[14,1,14,4],[15,1,15,4],[16,1,16,4],[49,1,49,7],[47,1,47,3],[47,5,47,6],[4,2,4,4],[6,1,6,2],[44,1,44,3],[44,5,44,6],[26,2,26,5],[31,3,31,6],[17,1,17,4],[18,1,18,4],[19,1,19,4],[46,5,46,6],[8,1,8,6],[11,1,11,4],[12,1,12,4],[0,2,0,3],[1,3,1,6],[33,9,33,13],[34,3,34,6],[21,1,21,4],[22,1,22,4],[23,1,23,4],[24,1,24,4],[2,1,2,6],[3,1,3,6]]}
[null,null,{"$f":"NOW()","v":"2020-07-23T18:20:44.220"}]
[null,null,"AAA Name:",{"$f":"+'Provider Information'!D21","v":0}]
[null,{"$f":"+'Provider Total Budget by Serv'!K4","v":"Transportation"}]
[null,"IN-KIND MATCH CERTIFICATION"]
[null,"Provider: ",{"$f":"IF(ISBLANK('Provider Information'!F6),\"\",+'Provider Information'!F6)","v":""}]
[]
[null,"In-kind Contribution(s):",null,{"$f":"+G25","v":0}]
[]
{"$rows_left_out":40}